{"text_format":"1","workbook":"xlsx","n_sheets":11,"sheets":["Cover","Assessment","Results","Definitions","<Test>","AnnexVI","PickLists","GHG_Lookup","Env Score","Eco Score","Soc Score"],"not_rendered":{"charts":0,"images":1,"macros":1,"external_links":0,"defined_names":45,"comments":0,"pivot_tables":0},"unopened":[],"bounds":{"document_bytes":16777216,"sheet_cells":100000,"rows_first":2000,"rows_last":500,"rows_between":2000,"halvings":0,"cell_chars":16384,"cell_head_chars":4096},"cells_cut":0,"cells_raw":0,"read":"whole","date_system":"1900"}

{"sheet":"Cover","index":0,"n_rows":31,"n_cols":2,"rows_kept":31,"cut":false,"hidden":false,"merged":[]}
[]
[]
[]
[]
[]
[]
[]
[]
[null,"Biomass Sustainability Framework Assessment"]
[]
[null,"Version 1.1"]
[]
[null,"2020-05-15"]
[]
[null,"Sustainable Energy Authority of Ireland"]
{"$rows_left_out":17}
{"sheet":"Assessment","index":1,"n_rows":230,"n_cols":9,"rows_kept":230,"cut":false,"hidden":false,"merged":[[148,0,228,0],[32,2,32,6],[10,2,10,6],[13,2,13,6],[14,5,14,6],[15,5,17,6],[12,2,12,6],[4,0,22,0],[23,0,147,0],[33,2,33,6],[11,2,11,5],[157,2,158,2],[157,4,158,4],[8,2,8,6],[5,2,5,6]]}
[]
[null,null,"Biomass Sustainability Framework  Assessment"]
[]
[null,"Show","No.","Condition","Question","Answer","Comment","PickList","Blank text"]
["Guidance",1]
[null,1,"The recast Renewable Energy Directive (RED II) sets out the EU's scheme for the promotion of energy from renewable resources and a binding EU-wide target for the overall share of energy from renewable sources in gross final consumption of energy in 2030."]
[null,1,{"$f":"HYPERLINK(\"https://eur-lex.europa.eu/legal-content/EN/TXT/?uri=uriserv:OJ.L_.2018.328.01.0082.01.ENG\",\">>> Directive (EU) 2018/2001 of the European Parliament and of the Council of 11 December 2018 on the promotion of the use of energy from renewable sources (recast)\")","v":">>> Directive (EU) 2018/2001 of the European Parliament and of the Council of 11 December 2018 on the promotion of the use of energy from renewable sources (recast)"}]
[null,1]
[null,1,"From 2021, biomass fuels must meet the environmental sustainability criteria set out in RED II (Article 29) in order to contribute towards the renewable energy target or qualify for financial support from a Member State.  However, there are other factors that could be considered when assessing the sustainability of a biomass fuel that go beyond the environmental criteria set out in RED II, and include economic and social criteria. "]
[null,1]
[null,1,"In this context, SEAI developed this framework for assessing sustainabilty risk.  The framework is built on a 'decision tree' approach, whereby answering specific questions determines where the risks may lie.  Please refer to the accompanying report for further guidance, Sustainability Criteria Options and Impacts for Irish Bioenergy Resources, commissioned by SEAI, prepared by Byrne Ó Cléirigh and Navigant, 2018:"]
[null,1,"https://www.seai.ie/sustainable-solutions/renewable-energy/bioenergy/sustainability-criteria-o/"]
[null,1]
[null,1,"The Sustainability Framework Assessment consists of four sections which the user must complete in turn."]
[null,1,1,null,"Sustainability under RED II","This section guides the user in assessing a biomass fuel against the sustainability criteria of RED II.  At a minimum, the biomass fuel must meet the RED II criteria in order to continue with the assessment."]
{"$rows_left_out":216}
{"sheet":"Results","index":2,"n_rows":43,"n_cols":8,"rows_kept":43,"cut":false,"hidden":false,"merged":[]}
[]
[null,"Results"]
[]
[null,"1 Sustainability Under RED II"]
[null,"Biomass fuel is compliant with RED II criteria:",{"$f":"IF(Assessment!$F$148>0,\"Yes\",\"No\")","v":"No"}]
[]
[null,"The risk scores below indicate where a risk to sustainability may exist; the risk under different indicators are not comparable."]
[null,"2 Environmental Indicators","Score","Risk"]
[null,"GHG emissions (RED II methodology)",{"$f":"IF(AND(Assessment!$F$148>0,INDIRECT(\"'Env Score'!I\"&$E9)=0),INDIRECT(\"'Env Score'!N\"&$E9),\"-\")","v":"-"},{"$f":"_xlfn.IFS(C9=\"-\",Risk_message,C9<(1/3),\"Low\",AND(C9>=(1/3),C9<(2/3)),\"Moderate\",C9>=(2/3),\"Investigate\")","v":"No score.  Please answer all relevant questions on the Assessment sheet."},20]
[null,"Carbon debt / reduction in carbon stock of land",{"$f":"IF(AND(Assessment!$F$148>0,INDIRECT(\"'Env Score'!I\"&$E10)=0),INDIRECT(\"'Env Score'!N\"&$E10),\"-\")","v":"-"},"No score.  Please answer all relevant questions on the Assessment sheet.",26]
[null,"Air quality",{"$f":"IF(AND(Assessment!$F$148>0,INDIRECT(\"'Env Score'!I\"&$E11)=0),INDIRECT(\"'Env Score'!N\"&$E11),\"-\")","v":"-"},"No score.  Please answer all relevant questions on the Assessment sheet.",33]
[null,"Water quality",{"$f":"IF(AND(Assessment!$F$148>0,INDIRECT(\"'Env Score'!I\"&$E12)=0),INDIRECT(\"'Env Score'!N\"&$E12),\"-\")","v":"-"},"No score.  Please answer all relevant questions on the Assessment sheet.",39]
[null,"Water use",{"$f":"IF(AND(Assessment!$F$148>0,INDIRECT(\"'Env Score'!I\"&$E13)=0),INDIRECT(\"'Env Score'!N\"&$E13),\"-\")","v":"-"},"No score.  Please answer all relevant questions on the Assessment sheet.",47]
[null,"Soil quality",{"$f":"IF(AND(Assessment!$F$148>0,INDIRECT(\"'Env Score'!I\"&$E14)=0),INDIRECT(\"'Env Score'!N\"&$E14),\"-\")","v":"-"},"No score.  Please answer all relevant questions on the Assessment sheet.",53]
[null,"Biodiversity",{"$f":"IF(AND(Assessment!$F$148>0,INDIRECT(\"'Env Score'!I\"&$E15)=0),INDIRECT(\"'Env Score'!N\"&$E15),\"-\")","v":"-"},"No score.  Please answer all relevant questions on the Assessment sheet.",59,null,null,"Default weight"]
{"$rows_left_out":29}
{"sheet":"Definitions","index":3,"n_rows":19,"n_cols":3,"rows_kept":19,"cut":false,"hidden":false,"merged":[]}
[null,"Definitions"]
[null,"The following are the RED II definitions that apply to this framework."]
[]
[null,"agricultural biomass","biomass produced from agriculture"]
[null,"agricultural, aquaculture, fisheries and forestry residues","residues that are directly generated by agriculture, aquaculture, fisheries and forestry and that do not include residues from related industries or processing"]
[null,"biofuels","liquid fuel for transport produced from biomass"]
[null,"biogas","gaseous fuels produced from biomass"]
[null,"bioliquids","liquid fuel for energy purposes other than for transport, including electricity and heating and cooling, produced from biomass"]
[null,"biomass","the biodegradable fraction of products, waste and residues from biological origin from agriculture, including vegetal and animal substances, from forestry and related industries, including fisheries and aquaculture, as well as the biodegradable fraction of waste, including industrial and municipal waste of biological origin"]
[null,"biomass fuel","gaseous and solid fuels produced from biomass"]
[null,"biowaste","biowaste as defined in point (4) of Article 3 of Directive 2008/98/EC [Waste Framework Directive]"]
[null,"default value [for GHG saving]","a value [for GHG saving] derived from a typical value by the application of pre-determined factors and that may, in circumstances specified in this Directive, be used in place of an actual value"]
[null,"forest biomass","biomass produced from forestry"]
[null,"forest regeneration","the re-establishment of a forest stand by natural or artificial means following the removal of the previous stand by felling or as a result of natural causes, including fire or storm"]
[null,"renewable energy obligation","(6) ‘renewable energy obligation’ means a support scheme requiring energy producers to include a given share of energy from renewable sources in their production, requiring energy suppliers to include a given share of energy from renewable sources in their supply, or requiring energy consumers to include a given share of energy from renewable sources in their consumption, including schemes under which such requirements may be fulfilled by using green certificates;"]
{"$rows_left_out":5}
{"sheet":"<Test>","index":4,"n_rows":0,"n_cols":0,"rows_kept":0,"cut":false,"hidden":true,"merged":[]}

{"sheet":"AnnexVI","index":5,"n_rows":141,"n_cols":6,"rows_kept":141,"cut":false,"hidden":true,"merged":[]}
["Field 1","Field 2","Field 3","Field 4","Default"]
["Type","Production system","Case","Transport distance  or biogas type","Heat ","Electricity "]
["Woodchips","Forest residues",null,"1 to 500 km",0.91,0.87]
["Woodchips","Forest residues",null,"500 to 2,500 km",0.87,0.81]
["Woodchips","Forest residues",null,"2,500 to 10,000 km",0.78,0.67]
["Woodchips","Forest residues",null,"Above 10,000 km",0.6,0.41]
["Woodchips","Short Rotation Coppice (eucalyptus)",null,"2,500 to 10,000 km",0.73,0.6]
["Woodchips","Short Rotation Coppice (poplar - fertilised)",null,"1 to 500 km",0.87,0.81]
["Woodchips","Short Rotation Coppice (poplar - fertilised)",null,"500 to 2,500 km",0.84,0.76]
["Woodchips","Short Rotation Coppice (poplar - fertilised)",null,"2,500 to 10,000 km",0.74,0.62]
["Woodchips","Short Rotation Coppice (poplar - fertilised)",null,"Above 10,000 km",0.56999999999999995,0.35]
["Woodchips","Short Rotation Coppice (poplar - no fertilisation)",null,"1 to 500 km",0.9,0.85]
["Woodchips","Short Rotation Coppice (poplar - no fertilisation)",null,"500 to 2,500 km",0.86,0.79]
["Woodchips","Short Rotation Coppice (poplar - no fertilisation)",null,"2,500 to 10,000 km",0.77,0.65]
["Woodchips","Short Rotation Coppice (poplar - no fertilisation)",null,"Above 10,000 km",0.59,0.39]
{"$rows_left_out":127}
{"sheet":"PickLists","index":6,"n_rows":11,"n_cols":42,"rows_kept":11,"cut":false,"hidden":true,"merged":[]}
["YesNo","SolGas","Source","Countries","EU",null,null,"Process_Energy","WR_Solid_Feed","WR_solid_dist_list","WR_Gas_Feed","Ag_Solid_Feed","Ag_solid_dist_list","Ag_Gas_Feed","F_Solid_Feed","Woodchip_dist_list","Wood_pellet_dist_list","F_Gas_Feed","Wood_form",null,"Solid_dist_1","Solid_dist_2","Solid_dist_3","Heat_Elec","Open_closed","MM_ratio","Pellet_processing","Pellet_processing_case","Biogas_processing","Biogas_processing_case","Other","Biomass_use","Replacing","Infrastructure","Growth period","Origin_share","YesNoUnknown","HiMedLow","Equipment","Opinion","BWS_Indicator","Risk_message"]
["Yes","Solid","Waste","Ireland","Ireland","< 40 years","<= 50%","Biomass","Wood industry residues","Solid_dist_1","Wet manure","Agri residues, density <0.2 t/m^3","Solid_dist_1","Maize whole plant","Forest residues","Solid_dist_1","Solid_dist_1","Other","Woodchips","Woodchips","1 to 500 km","2,500 to 10,000 km","1 to 500 km","Heat","Open","80% - 20%","Natural gas boiler, grid electricity","Case 1","Heat and elec from biogas CHP","Case 1","Other","Heat","Fossil fuel","Extensive development of new infratructure","<= 2 year","<=10%","Yes","Low","Significant capital investment","Favourable","> 3","No score.  Please answer all relevant questions on the Assessment sheet."]
["No","Gas","Residue*","EU (other than IE)","EU (other than IE)",">= 40 years","> 50%","On-site renewables","Other","Other","Biowaste","Agri residues, density >0.2 t/m^3","Solid_dist_1","Manure - Maize, 80% - 20%","Short Rotation Coppice (eucalyptus)","Solid_dist_2","Solid_dist_2",null,"Pellets / briquettes","Wood pellets","500 to 2,500 km","Other","500 to 10,000 km","Electricity","Closed","70% - 30%","Woodchip boiler, grid electricity","Case 2a","Elec from grid, heat from biogas CHP","Case 2",null,"Electricity","Grid electricity","Significant modification of existing infrastructure","> 2 years","> 10%, <= 50%","No","Medium","Moderate capital investment","Neutral","≤ 3"]
[null,null,"Agriculture (incl. agri residue)","EEA or CH (other than EU)",null,null,null,"Grid electricity",null,null,{"$f":"AnnexVI!B136","v":"Wet manure (IE - indicative)"},"Straw pellets","Solid_dist_3","Manure - Maize, 70% - 30%","Short Rotation Coppice (poplar - fertilised)","Solid_dist_1","Solid_dist_3",null,null,null,"2,500 to 10,000 km",null,"Above 10,000 km",null,null,"60% - 40%","Woodchip in CHP","Case 3a","Elec from grid, heat from biogas boiler","Case 3",null,"Heat and electricity","Other renewables","Minor or no modification of existing infrastructure",null,"> 50%","Unknown","High","Minor or no capital investment","Unfavourable"]
[null,null,"Forestry (incl. forestry residue)","Other",null,null,null,"Fossil fuel",null,null,"Other","Bagasse briquettes","Solid_dist_3","Manure - Maize, 60% - 40%","Short Rotation Coppice (poplar - no fertilisation)","Solid_dist_1","Solid_dist_3",null,null,null,"Above 10,000 km",null,null,null,null,"Other","Other",null,"Other"]
[null,null,"Other",null,null,null,null,null,null,null,null,"Palm kernel meal","Solid_dist_3",{"$f":"AnnexVI!B135","v":"Grass silage (IE - indicative)"},"Stemwood","Solid_dist_1","Solid_dist_1"]
[null,null,null,null,null,null,null,null,null,null,null,"Palm kernel meal (no CH4 emission from oil mill)","Solid_dist_3",{"$f":"AnnexVI!B137","v":"Grass silage - wet manure, 40% - 60% (IE - indicative)"},{"$f":"AnnexVI!B138","v":"Forest residues (IE - indicative)"},"Other","Other"]
[null,null,null,null,null,null,null,null,null,null,null,{"$f":"AnnexVI!B132","v":"Miscanthus bales (IE - indicative)"},"Other","Other",{"$f":"AnnexVI!B139","v":"Forest residues imported from USA (IE - indicative)"}]
[null,null,null,null,null,null,null,null,null,null,null,{"$f":"AnnexVI!B133","v":"Miscanthus pellets (IE - indicative)"},null,null,{"$f":"AnnexVI!B140","v":"Short rotation coppice (willow) pellets (IE - indicative)"}]
[null,null,null,null,null,null,null,null,null,null,null,{"$f":"AnnexVI!B134","v":"Straw pellets (IE - indicative)"},null,null,{"$f":"AnnexVI!B141","v":"Short rotation coppice (willow) chips (IE - indicative)"}]
[null,null,null,null,null,null,null,null,null,null,null,"Other",null,null,"Other"]

{"sheet":"GHG_Lookup","index":7,"n_rows":50,"n_cols":12,"rows_kept":50,"cut":false,"hidden":true,"merged":[]}
[]
[null,"Solid/gaseous",null,{"$f":"Assessment!F27","v":"-- Select from dropdown --"},{"$f":"MATCH(D2,SolGas,0)","v":{"$error":"#N/A"}}]
[null,"Source type",null,{"$f":"Assessment!F29","v":"-- Select from dropdown --"},{"$f":"MATCH(D3,Source,0)","v":{"$error":"#N/A"}},null,null,null,null,{"$f":"PickLists!$C$2","v":"Waste"},{"$f":"PickLists!$C$4","v":"Agriculture (incl. agri residue)"},{"$f":"PickLists!$C$5","v":"Forestry (incl. forestry residue)"}]
[null,"Form",null,{"$f":"Assessment!F49","v":"-- Select from dropdown --"},{"$f":"MATCH(D4,Wood_form,0)","v":{"$error":"#N/A"}},null,null,null,{"$f":"PickLists!$B$2","v":"Solid"},{"$f":"PickLists!$I$1","v":"WR_Solid_Feed"},{"$f":"PickLists!$L$1","v":"Ag_Solid_Feed"},{"$f":"PickLists!$O$1","v":"F_Solid_Feed"}]
[null,"Feedstock list",null,{"$f":"HLOOKUP($D$3,$J$3:$L$5,MATCH($D$2,I3:I5,0),FALSE)","v":{"$error":"#N/A"}},null,null,null,null,{"$f":"PickLists!$B$3","v":"Gas"},{"$f":"PickLists!$K$1","v":"WR_Gas_Feed"},{"$f":"PickLists!$N$1","v":"Ag_Gas_Feed"},{"$f":"PickLists!$R$1","v":"F_Gas_Feed"}]
["F2","Feedstock pick",null,{"$f":"Assessment!F37","v":0},{"$f":"MATCH(D6,INDIRECT(D5),0)","v":{"$error":"#N/A"}}]
[]
[null,"Processing energy list",null,{"$f":"_xlfn.IFS(Assessment!$F$27=PickLists!$B$3,PickLists!$AC$1,AND(Assessment!$F$27=PickLists!$B$2,Assessment!$F$48=PickLists!$S$3),PickLists!$AA$1,\"TRUE\",PickLists!$AE$1)","v":"Other"}]
[null,"Processing energy",null,{"$f":"Assessment!F51","v":0},{"$f":"MATCH(D9,INDIRECT(D8),0)","v":{"$error":"#REF!"}}]
[null,"Processing case list",null,{"$f":"IF(D8=PickLists!AA1,PickLists!AB1,IF(D8=PickLists!$AC$1,PickLists!$AD$1,\"\"))","v":""}]
["F3","Processing case",null,{"$f":"IFERROR(INDEX(INDIRECT(D10),E9),\"\")","v":""}]
[]
[null,null,null,null,null,null,null,null,{"$f":"PickLists!$J$1","v":"WR_solid_dist_list"},{"$f":"PickLists!M1","v":"Ag_solid_dist_list"},{"$f":"PickLists!P1","v":"Woodchip_dist_list"},{"$f":"PickLists!Q1","v":"Wood_pellet_dist_list"}]
[null,"Use",null,{"$f":"Assessment!F64","v":"-- Select from dropdown --"},{"$f":"MATCH(D14,Biomass_use,0)","v":{"$error":"#N/A"}},null,null,{"$f":"MATCH(1,I14:L14,0)","v":{"$error":"#N/A"}},{"$f":"IF(AND(D3=PickLists!$C$2,D6=PickLists!$I$2),1,0)","v":0},{"$f":"IF(AND(D3=PickLists!$C$4,D2=PickLists!$B$2),1,0)","v":0},{"$f":"IF(AND(D2=PickLists!$B$2,D3=PickLists!$C$5,D4=PickLists!$S$2),1,0)","v":0},{"$f":"IF(AND(D2=PickLists!$B$2,D3=PickLists!$C$5,D4=PickLists!$S$3),1,0)","v":0}]
[]
{"$rows_left_out":36}
{"sheet":"Env Score","index":8,"n_rows":81,"n_cols":16,"rows_kept":81,"cut":false,"hidden":true,"merged":[]}
[null,null,"Fuel type",{"$f":"Assessment!F27","v":"-- Select from dropdown --"}]
[null,null,"Country of Origin",{"$f":"Assessment!F81","v":"-- Select from dropdown --"}]
[null,null,"Biomass source",{"$f":"Assessment!F29","v":"-- Select from dropdown --"}]
[null,null,"Use",{"$f":"Assessment!$F$64","v":"-- Select from dropdown --"}]
[null,null,"GHG saving, heat",{"$f":"GHG_Lookup!D41","v":0}]
[null,null,"GHG saving, elec",{"$f":"GHG_Lookup!D42","v":0}]
[null,null,"GHG saving",{"$f":"_xlfn.IFS($D$4=PickLists!$AF$2,$D$5,$D$4=PickLists!$AF$3,$D$6,$D$4=PickLists!$AF$4,AVERAGE($D$5:$D$6))","v":{"$error":"#N/A"}}]
[null,null,"RED II compliant",{"$f":"Assessment!$F$148","v":0}]
[null,null,null,null,null,null,"B","F"]
["Section.","Assessment No.","Indicator","Q #","Question / means of assessment","Row","Q 'on'?","A blank?","A outstanding?",null,null,"Modifier","Value","Risk score",null,"Warning"]
["7.4.1.1",2.1,"GHG emissions",null,null,null,null,null,null,null,null,null,null,0]
[null,null,null,"1.2.10","What is the GHG saving, as calculated using the RED II methodology?",{"$f":"ROW(Assessment!C77)","v":77},null,null,null,"< 70%",{"$f":"--($D$7<0.7)","v":{"$error":"#N/A"}},"Add",1,{"$f":"N11+M12*K12","v":{"$error":"#N/A"}}]
[null,null,null,null,null,null,null,null,null,"≥ 70%, < 80%",{"$f":"--AND($D$7>=0.7,$D$7<0.8)","v":{"$error":"#N/A"}},"Add",{"$f":"2/3","v":0.66666666666666663},{"$error":"#N/A"}]
[null,null,null,null,null,null,null,null,null,"≥ 80%, < 90%",{"$f":"--AND($D$7>=0.8,$D$7<0.9)","v":{"$error":"#N/A"}},"Add",{"$f":"1/3","v":0.33333333333333331},{"$error":"#N/A"}]
[null,null,null,null,null,null,null,null,null,"≥ 90%",{"$f":"--(D7>=0.9)","v":{"$error":"#N/A"}},"Add",0,{"$error":"#N/A"}]
{"$rows_left_out":67}
{"sheet":"Eco Score","index":9,"n_rows":75,"n_cols":16,"rows_kept":75,"cut":false,"hidden":true,"merged":[]}
[null,null,"Fuel type",{"$f":"Assessment!F27","v":"-- Select from dropdown --"}]
[null,null,"Country of Origin",{"$f":"Assessment!F81","v":"-- Select from dropdown --"}]
[null,null,"Biomass source",{"$f":"Assessment!F29","v":"-- Select from dropdown --"}]
[null,null,"Use",{"$f":"Assessment!$F$64","v":"-- Select from dropdown --"}]
[null,null,"GHG saving, heat",{"$f":"GHG_Lookup!D41","v":0}]
[null,null,"GHG saving, elec",{"$f":"GHG_Lookup!D42","v":0}]
[null,null,"GHG saving",{"$f":"_xlfn.IFNA(_xlfn.IFS($D$4=PickLists!$AF$2,$D$5,$D$4=PickLists!$AF$3,$D$6,$D$4=PickLists!$AF$4,MIN($D$5:$D$6)),0)","v":0}]
[]
[null,null,null,null,null,null,"B","F"]
["Section.","Assessment No.","Indicator","Q #","Question / means of assessment","Row","Q 'on'?","A blank?","A outstanding?",null,null,"Modifier","Value","Risk score",null,"Warning"]
["7.4.2.1",null,"Energy security & diversity",null,null,null,null,null,null,null,null,null,null,0]
[null,null,null,"1.3.1","Country of Origin:",{"$f":"ROW(Assessment!$C$81)","v":81},{"$f":"INDIRECT(\"Assessment!\"&G$9&$F12)","v":0},{"$f":"--OR(ISBLANK(INDIRECT(\"Assessment!\"&H$9&$F12)),NOT(ISERROR(FIND(\"--\",INDIRECT(\"Assessment!\"&H$9&$F12)))))","v":1},{"$f":"G12*H12","v":0},"Ireland",{"$f":"--($D$2=J12)","v":0},"Add",0,{"$f":"N11+M12*K12","v":0}]
[null,null,null,null,null,null,null,null,null,"Not Ireland",{"$f":"--($D$2<>J12)","v":1},"Add",1,1]
[null,null,null,"1.3.1","Another MS",{"$f":"ROW(Assessment!$C$81)","v":81},{"$f":"INDIRECT(\"Assessment!\"&G$9&$F14)","v":0},{"$f":"--OR(ISBLANK(INDIRECT(\"Assessment!\"&H$9&$F14)),NOT(ISERROR(FIND(\"--\",INDIRECT(\"Assessment!\"&H$9&$F14)))))","v":1},{"$f":"G14*H14","v":0},null,{"$f":"--($D$2=PickLists!$D$3)","v":0},"Add",-0.25,1]
[null,null,null,"3.1.1","For non IE, Proportion of Ireland's biomass consumption provided by the country of origin",{"$f":"ROW(Assessment!C188)","v":188},{"$f":"INDIRECT(\"Assessment!\"&G$9&$F15)","v":0},{"$f":"--OR(ISBLANK(INDIRECT(\"Assessment!\"&H$9&$F15)),NOT(ISERROR(FIND(\"--\",INDIRECT(\"Assessment!\"&H$9&$F15)))))","v":1},{"$f":"G15*H15","v":0},{"$f":"PickLists!AJ2","v":"<=10%"},{"$f":"$K$13*(--(Assessment!$F$188=J15))","v":0},"Add",-0.5,1]
{"$rows_left_out":61}
{"sheet":"Soc Score","index":10,"n_rows":40,"n_cols":16,"rows_kept":40,"cut":false,"hidden":true,"merged":[]}
[null,null,"Fuel type",{"$f":"Assessment!F27","v":"-- Select from dropdown --"}]
[null,null,"Country of Origin",{"$f":"Assessment!F81","v":"-- Select from dropdown --"}]
[null,null,"Biomass source",{"$f":"Assessment!F29","v":"-- Select from dropdown --"}]
[null,null,"Use",{"$f":"Assessment!$F$64","v":"-- Select from dropdown --"}]
[null,null,"GHG saving, heat",{"$f":"GHG_Lookup!D41","v":0}]
[null,null,"GHG saving, elec",{"$f":"GHG_Lookup!D42","v":0}]
[null,null,"GHG saving",{"$f":"_xlfn.IFNA(_xlfn.IFS($D$4=PickLists!$AF$2,$D$5,$D$4=PickLists!$AF$3,$D$6,$D$4=PickLists!$AF$4,MIN($D$5:$D$6)),0)","v":0}]
[]
[null,null,null,null,null,null,"B","F"]
["Section.","Assessment #","Indicator","Q #","Question / means of assessment","Row","Q 'on'?","A blank?","A outstanding?",null,null,"Modifier","Value","Risk score",null,"Warning"]
[]
["7.4.3.1",4.0999999999999996,"Acceptability",null,null,null,null,null,null,null,null,null,null,0]
[null,null,null,"4.1.1","What is stakeholder opinion towards extracting / cultivating, processing and using the biomass?",{"$f":"ROW(Assessment!C217)","v":217},{"$f":"INDIRECT(\"Assessment!\"&G$9&$F13)","v":0},{"$f":"--OR(ISBLANK(INDIRECT(\"Assessment!\"&H$9&$F13)),NOT(ISERROR(FIND(\"--\",INDIRECT(\"Assessment!\"&H$9&$F13)))))","v":1},{"$f":"G13*H13","v":0},{"$f":"PickLists!AN2","v":"Favourable"},{"$f":"--(Assessment!$F$217=J13)","v":0},"Add",0,{"$f":"N12+M13*K13","v":0}]
[null,null,null,null,null,null,null,null,null,{"$f":"PickLists!AN3","v":"Neutral"},{"$f":"--(Assessment!$F$217=J14)","v":0},"Add",0.25,0]
[null,null,null,null,null,null,null,null,null,{"$f":"PickLists!AN4","v":"Unfavourable"},{"$f":"--(Assessment!$F$217=J15)","v":0},"Add",0.5,0]
{"$rows_left_out":25}